{"text_format":"1","workbook":"xlsx","n_sheets":2,"sheets":["Lists","ALL Crest"],"not_rendered":{"charts":0,"images":1,"macros":1,"external_links":0,"defined_names":15,"comments":0,"pivot_tables":0},"unopened":[],"bounds":{"document_bytes":16777216,"sheet_cells":100000,"rows_first":2000,"rows_last":500,"rows_between":2000,"halvings":0,"cell_chars":16384,"cell_head_chars":4096},"cells_cut":0,"cells_raw":0,"read":"whole","date_system":"1900"}

{"sheet":"Lists","index":0,"n_rows":88,"n_cols":43,"rows_kept":88,"cut":false,"hidden":false,"merged":[[27,0,27,1],[27,3,27,4],[27,5,27,6]]}
[]
["MODEL","BOILER TYPE","MAKE","MODEL","AHRI EFFICIENCY","FUEL","INPUT\n(btuh)","MAX.\nOUTPUT\n(btuh)","MIN.\nOUTPUT\n(btuh)","TURNDOWN RATIO","MIN-MAX. INLET PRESSURE\n(IN. W.C.)","GALLON CAPACITY","Max. Pressure Rating","Relief Valve Pressure Rating","MINIMUM FLOW RATE (GPM)","MAXIMUM FLOW RATE (GPM)","DESIGN SYSTEM \nDELTA T\n(oF)","20°F ΔT WATER FLOW (GPM)","HEAD LOSS\n(FT. OF HD.)","E.W.T.\n(oF)","L.W.T.\n(oF)","VOLTAGE/\nPHASE","TOTAL AMPS (FLA)","VENT SIZE","VENT MATERIAL","OPERATING WEIGHT   (lbs.)","DIMENSIONS",null,"Relief Valve PSI","Fuel","DeltaT","MODEL","FLOW\n20","FT/HD\n20","MODEL","FLOW\n30","FT/HD\n30","MODEL","FLOW\n40","FT/HD\n40","MODEL","FLOW\n60","FT/HD\n60"]
["FB-0751","Condensing\nStainless Steel \nFiretube","LOCHINVAR","FB-0751",0.96199999999999997,null,750000,722000,48100,"15:1",null,73,160,null,18,350,null,null,null,null,null,"120V/1PH/\n60Hz",5,6,"SS, CPVC, PVC, or Polypro",1768,"78 x 30\nx 57-5/8",null,50,"Natural Gas",20,"FB-0751",72,4.8,"FB-0751",48.18,3.8,"FB-0751",36,3,"FB-0751",24,2.5]
["FB-1001","Condensing\nStainless Steel\nFiretube","LOCHINVAR","FB-1001",0.96199999999999997,null,999000,961000,48100,"20:1",null,77,160,null,18,350,null,null,null,null,null,"120V/1PH/\n60Hz",6,6,"SS, CPVC, PVC, or Polypro",1838,"78 x 30\nx 57-5/8",null,75,"LP",30,"FB-1001",96,8.3000000000000007,"FB-1001",64.17,6.9,"FB-1001",48,6,"FB-1001",32,5.5]
["FB-1251","Condensing\nStainless Steel\nFiretube","LOCHINVAR","FB-1251",0.96199999999999997,null,1250000,1203000,{"$f":"H5/20","v":60150},"20:1",null,87,160,null,18,350,null,null,null,null,null,"120V/1PH/\n60Hz",7,8,"SS, CPVC, PVC, or Polypro",1975,"78 x 30\nx 57-3/4",null,100,"DUAL (Nat./LP)",40,"FB-1251",120,9.1999999999999993,"FB-1251",80.3,7,"FB-1251",60,6,"FB-1251",40,4.0999999999999996]
["FB-1501","Condensing\nStainless Steel\nFiretube","LOCHINVAR","FB-1501",0.96199999999999997,null,1500000,1443000,{"$f":"H6/25","v":57720},"25:1",null,94,160,null,25,350,null,null,null,null,null,"120V/1PH/\n60Hz",10,8,"SS, CPVC, PVC, or Polypro",2307,"78 x 30 x 68",null,125,null,60,"FB-1501",144,12.3,"FB-1501",96.35,8.9,"FB-1501",72,7.3,"FB-1501",78,5.8]
["FB-1751","Condensing\nStainless Steel\nFiretube","LOCHINVAR","FB-1751",0.96199999999999997,null,1750000,1684000,{"$f":"H7/25","v":67360},"25:1",null,106,160,null,25,350,null,null,null,null,null,"120V/1PH/\n60Hz",10,8,"SS, CPVC, PVC, or Polypro",2458,"78 x 30 x 68",null,150,null,null,"FB-1751",168,13.8,"FB-1751",112.41,10,"FB-1751",84,8.1,"FB-1751",56,6.7]
["FB-2001","Condensing\nStainless Steel\nFiretube","LOCHINVAR","FB-2001",0.96199999999999997,null,1999000,1923000,{"$f":"H8/25","v":76920},"25:1",null,111,160,null,25,350,null,null,null,null,null,"120V/1PH/\n60Hz",13,8,"SS, CPVC, PVC, or Polypro",2570,"78 x 30 x 68",null,null,null,null,"FB-2001",192,14.5,"FB-2001",128.41,10.1,"FB-2001",96,8.1,"FB-2001",64,6.6]
["FB-2501","Condensing\nStainless Steel\nFiretube","LOCHINVAR","FB-2501",0.96,null,2500000,2400000,120000,"20:1",null,157,160,null,25,350,null,null,null,null,null,"208V/3PH/\n60Hz",4.5,9,"SS, CPVC, PVC, or Polypro",3600,"77-3/4 x 35 x 83-3/4",null,null,null,null,"FB-2501",240,8.4,"FB-2501",160.26,6.2,"FB-2501",120,5.3,"FB-2501",80,4.8]
["FB-3001","Condensing\nStainless Steel\nFiretube","LOCHINVAR","FB-3001",0.96,null,3000000,2883000,{"$f":"H10/20","v":144150},"20:1",null,156,160,null,25,350,null,null,null,null,null,"208V/3PH/\n60Hz",6.5,10,"SS, CPVC, PVC, or Polypro",3900,"77-3/4 x 35 x 83-3/4",null,null,null,null,"FB-3001",288,8,"FB-3001",192.31,5.2,"FB-3001",144,4,"FB-3001",96,3.3]
["FB-3501","Condensing\nStainless Steel\nFiretube","LOCHINVAR","FB-3501",0.96,null,3500000,3364000,{"$f":"H11/20","v":168200},"20:1",null,202,160,null,45,350,null,null,null,null,null,"208V/3PH/\n60Hz",6.5,10,"SS, CPVC, PVC, or Polypro",4600,"77-3/4 x 42 x 91-1/2",null,null,null,null,"FB-3501",336,9.9,"FB-3501",224.36,6.1,"FB-3501",168,5,"FB-3501",112,3.8]
["FB-4001","Condensing\nStainless Steel\nFiretube","LOCHINVAR","FB-4001",0.96,null,3999000,3843000,{"$f":"H12/12","v":320250},"12:1",null,201,160,null,45,350,null,null,null,null,null,"480V/3PH/\n60Hz",6,12,"SS, CPVC, PVC, or Polypro",5200,"77-3/4 x 45-1/2 x 103-1/2",null,null,null,null,"FB-4001","350*\n(Based on 22oF pT)",10.9,"FB-4001",256.35000000000002,7.6,"FB-4001",192,5.9,"FB-4001",128,4.4000000000000004]
["FB-5001","Condensing\nStainless Steel\nFiretube","LOCHINVAR","FB-5001",0.96,null,4999000,4804000,{"$f":"H13/10","v":480400},"10:1",null,254,160,null,50,600,null,null,null,null,null,"480V/3PH/\n60Hz",5,14,"Stainless Steel",5900,"77-3/4 x 46-1/2 x 102-1/4",null,null,null,null,"FB-5001",480,13.9,"FB-5001",320.45,10.7,"FB-5001",240,7.6,"FB-5001",160,5.5]
["FB-6001","Condensing\nStainless Steel\nFiretube","LOCHINVAR","FB-6001",0.96,null,6000000,5766000,{"$f":"H14/10","v":576600},"10:1",null,304,160,null,60,600,null,null,null,null,null,"480V/3PH/\n60Hz",7,14,"Stainless Steel",6900,"77-3/4 x 50 x 102-3/4\"",null,null,null,null,"FB-6001",576,17.2,"FB-6001",384.62,13,"FB-6001",288,9.4,"FB-6001",192,6.8]
["OF-0751","Condensing\nStainless Steel \nFiretube OUTDOOR","LOCHINVAR","OF-0751",0.96199999999999997,null,750000,722000,48100,"15:1",null,73,160,null,18,350,null,null,null,null,null,"120V/1PH/\n60Hz",5,6,"SS, CPVC, PVC, or Polypro",1768,"87-1/8 x 30 x 67-3/8"]
["OF-1001","Condensing\nStainless Steel \nFiretube OUTDOOR","LOCHINVAR","OF-1001",0.96199999999999997,null,999000,961000,48100,"20:1",null,77,160,null,18,350,null,null,null,null,null,"120V/1PH/\n60Hz",6,6,"SS, CPVC, PVC, or Polypro",1838,"87-1/8 x 30 x 67-3/8"]
["OF-1251","Condensing\nStainless Steel \nFiretube OUTDOOR","LOCHINVAR","OF-1251",0.96199999999999997,null,1250000,1203000,{"$f":"H17/20","v":60150},"20:1",null,87,160,null,18,350,null,null,null,null,null,"120V/1PH/\n60Hz",7,8,"SS, CPVC, PVC, or Polypro",1975,"87-1/8 x 30 x 67-3/8"]
["OF-1501","Condensing\nStainless Steel \nFiretube OUTDOOR","LOCHINVAR","OF-1501",0.96199999999999997,null,1500000,1443000,{"$f":"H18/25","v":57720},"25:1",null,94,160,null,25,350,null,null,null,null,null,"120V/1PH/\n60Hz",10,8,"SS, CPVC, PVC, or Polypro",2307,"87-1/8 x 30 x 77-3/8"]
["OF-1751","Condensing\nStainless Steel \nFiretube OUTDOOR","LOCHINVAR","OF-1751",0.96199999999999997,null,1750000,1684000,{"$f":"H19/25","v":67360},"25:1",null,106,160,null,25,350,null,null,null,null,null,"120V/1PH/\n60Hz",10,8,"SS, CPVC, PVC, or Polypro",2458,"87-1/8 x 30 x 77-3/8"]
["OF-2001","Condensing\nStainless Steel \nFiretube OUTDOOR","LOCHINVAR","OF-2001",0.96199999999999997,null,1999000,1923000,{"$f":"H20/25","v":76920},"25:1",null,111,160,null,25,350,null,null,null,null,null,"120V/1PH/\n60Hz",13,8,"SS, CPVC, PVC, or Polypro",2570,"87-1/8 x 30 x 77-3/8"]
{"$rows_left_out":69}
{"sheet":"ALL Crest","index":1,"n_rows":38,"n_cols":27,"rows_kept":38,"cut":false,"hidden":false,"merged":[[0,6,0,10],[4,21,4,22],[0,11,0,24],[1,7,1,8],[2,7,2,8],[1,10,1,11],[2,10,2,11],[1,16,1,17],[4,23,4,26],[25,5,25,6],[4,0,4,4],[1,22,1,23],[2,22,2,23],[1,19,1,20],[2,19,2,20],[4,5,4,10],[4,11,4,20],[1,1,1,2],[2,1,2,2],[1,4,1,5],[2,4,2,5],[1,13,1,14],[2,13,2,14],[3,4,3,5],[2,16,2,17],[25,0,25,1],[32,1,32,2],[15,0,15,1],[28,0,28,2],[25,2,25,3],[36,0,36,3]]}
["Boiler Cascade Schedule:",null,null,null,null,null,"1. Select model from drop-down choices in \"Boiler X\" box(es).\n2. Choose the variables (w/red headings) to complete the line item.\nNOTE: Cell values can be manually changed as needed. A new copy of the \nschedule will be needed to restore auto-population.",null,null,null,null,"This schedule is designed to be used for up to 8 boilers that will be in a cascade. This means a number of specifications will be the same for each unit.\nUse the drop down menus in columns with red headings to select the desired spec.\nFor units that stand alone, or are in a different area of the building; use the RESET button to create separate schedules."]
[null,"Boiler 1",null,null,"Boiler 2",null,null,"Boiler 3",null,null,"Boiler 4",null,null,"Boiler 5",null,null,"Boiler 6",null,null,"Boiler 7",null,null,"Boiler 8"]
[]
[null,2,3,4,5,6,7,8,9,10,11,12,13,14,15,16,17,18,19,20,21,22,23,24,25,26,27]
["UNIT DESCRIPTION",null,null,null,null,"BURNER",null,null,null,null,null,"WATER",null,null,null,null,null,null,null,null,null,"ELECTRICAL",null,"DIMENSIONS"]
["TAG","BOILER TYPE","MAKE","MODEL","AHRI EFFICIENCY","FUEL","INPUT\n(btuh)","MAX.\nOUTPUT\n(btuh)","MIN.\nOUTPUT\n(btuh)","TURNDOWN RATIO","MIN-MAX. INLET PRESSURE\n(IN. W.C.)","GALLON CAPACITY","MAX.\nPRESSURE\nRATING\n(PSI)","RELIEF VALVE\nPRESSURE\nRATING\n(PSI)","MINIMUM FLOW RATE (GPM)","MAXIMUM FLOW RATE (GPM)","DESIGN SYSTEM \nDELTA T\n(oF)","WATER FLOW (GPM)\nBased on ΔT","HEAD LOSS\n(FT. OF HD.)\nBased on ΔT","RETURN\nW.T.\n(oF)","SUPPLY\nW.T.\n(oF)","VOLTAGE/\nPHASE","TOTAL AMPS (FLA)","VENT SIZE\n(inches)","VENT MATERIAL","OPERATING WEIGHT   (lbs.)","UNIT DIMENSIONS\n(inches)\nH x W x D"]
[{"$f":"IF($C7=\"lochinvar\",\"B-1\",\"\")","v":""},{"$f":"_xlfn.IFNA(VLOOKUP($B$3,Lists!$A:$AA,B4,FALSE),\"\")","v":""},{"$f":"_xlfn.IFNA(VLOOKUP($B$3,Lists!$A:$AA,C4,FALSE),\"\")","v":""},{"$f":"_xlfn.IFNA(VLOOKUP($B$3,Lists!$O29:R52,MATCH(F7,Lists!$O28:R28,0),FALSE),\"\")","v":""},{"$f":"_xlfn.IFNA(VLOOKUP($B$3,Lists!$A:$AA,E4,FALSE),\"\")","v":""},null,{"$f":"_xlfn.IFNA(VLOOKUP($B$3,Lists!$A:$Z,G4,FALSE),\"\")","v":""},{"$f":"_xlfn.IFNA(VLOOKUP($B$3,Lists!$A:$Z,H4,FALSE),\"\")","v":""},{"$f":"_xlfn.IFNA(VLOOKUP($B$3,Lists!$A:$Z,I4,FALSE),\"\")","v":""},{"$f":"_xlfn.IFNA(VLOOKUP($B$3,Lists!$A:$Z,J4,FALSE),\"\")","v":""},{"$f":"_xlfn.IFNA(VLOOKUP($B$3,Lists!$J29:$M52,MATCH(F7,Lists!$J28:M28,0),FALSE),\"\")","v":""},{"$f":"_xlfn.IFNA(VLOOKUP($B$3,Lists!$A:$Z,L4,FALSE),\"\")","v":""},{"$f":"_xlfn.IFNA(VLOOKUP($B$3,Lists!$A:$Z,M4,FALSE),\"\")","v":""},null,{"$f":"_xlfn.IFNA(VLOOKUP($B$3,Lists!$A:$Z,O4,FALSE),\"\")","v":""},{"$f":"_xlfn.IFNA(VLOOKUP($B$3,Lists!$A:$Z,P4,FALSE),\"\")","v":""},null,{"$f":"IF($Q7=20,VLOOKUP($B$3,Lists!$AF:$AG,2,FALSE),IF($Q7=30,VLOOKUP($B$3,Lists!$AI:$AJ,2,FALSE),IF($Q7=40,VLOOKUP($B$3,Lists!$AL:$AM,2,FALSE),IF($Q7=60,VLOOKUP($B$3,Lists!$AO:$AP,2,FALSE),\"\"))))","v":""},{"$f":"IF($Q7=20,VLOOKUP($B$3,Lists!$AF:$AH,3,FALSE),IF($Q7=30,VLOOKUP($B$3,Lists!$AI:$AK,3,FALSE),IF($Q7=40,VLOOKUP($B$3,Lists!$AL:$AN,3,FALSE),IF($Q7=60,VLOOKUP($B$3,Lists!$AO:$AQ,3,FALSE),\"\"))))","v":""},{"$f":"IF(U7=\"\",\"\",U7-Q7)","v":""},null,{"$f":"_xlfn.IFNA(VLOOKUP($B$3,Lists!$A:$Z,V4,FALSE),\"\")","v":""},{"$f":"_xlfn.IFNA(VLOOKUP($B$3,Lists!$A:$Z,W4,FALSE),\"\")","v":""},{"$f":"_xlfn.IFNA(VLOOKUP($B$3,Lists!$A:$Z,X4,FALSE),\"\")","v":""},{"$f":"_xlfn.IFNA(VLOOKUP($B$3,Lists!$A:$Z,Y4,FALSE),\"\")","v":""},{"$f":"_xlfn.IFNA(VLOOKUP($B$3,Lists!$A:$Z,Z4,FALSE),\"\")","v":""},{"$f":"_xlfn.IFNA(VLOOKUP($B$3,Lists!$A:$AA,AA4,FALSE),\"\")","v":""}]
[{"$f":"IF($C8=\"lochinvar\",\"B-2\",\"\")","v":""},{"$f":"_xlfn.IFNA(VLOOKUP($E$3,Lists!$A:$AA,B4,FALSE),\"\")","v":""},{"$f":"_xlfn.IFNA(VLOOKUP($E$3,Lists!$A:$AA,C4,FALSE),\"\")","v":""},{"$f":"_xlfn.IFNA(VLOOKUP($E$3,Lists!$O29:R52,MATCH(F8,Lists!$O28:R28,0),FALSE),\"\")","v":""},{"$f":"_xlfn.IFNA(VLOOKUP($E$3,Lists!$A:$AA,E4,FALSE),\"\")","v":""},{"$f":"IF($E8=\"\",\"\",F7)","v":""},{"$f":"_xlfn.IFNA(VLOOKUP($E$3,Lists!$A:$AA,G4,FALSE),\"\")","v":""},{"$f":"_xlfn.IFNA(VLOOKUP($E$3,Lists!$A:$AA,H4,FALSE),\"\")","v":""},{"$f":"_xlfn.IFNA(VLOOKUP($E$3,Lists!$A:$AA,I4,FALSE),\"\")","v":""},{"$f":"_xlfn.IFNA(VLOOKUP($E$3,Lists!$A:$AA,J4,FALSE),\"\")","v":""},{"$f":"_xlfn.IFNA(VLOOKUP($E$3,Lists!$J29:$M52,MATCH(F8,Lists!$J28:M28,0),FALSE),\"\")","v":""},{"$f":"_xlfn.IFNA(VLOOKUP($E$3,Lists!$A:$AA,L4,FALSE),\"\")","v":""},{"$f":"_xlfn.IFNA(VLOOKUP($E$3,Lists!$A:$AA,M4,FALSE),\"\")","v":""},{"$f":"IF($M8=\"\",\"\",N7)","v":""},{"$f":"_xlfn.IFNA(VLOOKUP($E$3,Lists!$A:$AA,O4,FALSE),\"\")","v":""},{"$f":"_xlfn.IFNA(VLOOKUP($E$3,Lists!$A:$AA,P4,FALSE),\"\")","v":""},{"$f":"IF($P8=\"\",\"\",Q7)","v":""},{"$f":"IF($Q8=20,VLOOKUP($B$3,Lists!$AF:$AG,2,FALSE),IF($Q8=30,VLOOKUP($B$3,Lists!$AI:$AJ,2,FALSE),IF($Q8=40,VLOOKUP($B$3,Lists!$AL:$AM,2,FALSE),IF($Q8=60,VLOOKUP($B$3,Lists!$AO:$AP,2,FALSE),\"\"))))","v":""},{"$f":"IF($Q8=20,VLOOKUP($B$3,Lists!$AF:$AH,3,FALSE),IF($Q8=30,VLOOKUP($B$3,Lists!$AI:$AK,3,FALSE),IF($Q8=40,VLOOKUP($B$3,Lists!$AL:$AN,3,FALSE),IF($Q8=60,VLOOKUP($B$3,Lists!$AO:$AQ,3,FALSE),\"\"))))","v":""},"",{"$f":"IF($V8=\"\",\"\",U7)","v":""},{"$f":"_xlfn.IFNA(VLOOKUP($E$3,Lists!$A:$AA,V4,FALSE),\"\")","v":""},{"$f":"_xlfn.IFNA(VLOOKUP($E$3,Lists!$A:$AA,W4,FALSE),\"\")","v":""},{"$f":"_xlfn.IFNA(VLOOKUP($E$3,Lists!$A:$AA,X4,FALSE),\"\")","v":""},{"$f":"IF($Z8=\"\",\"\",Y7)","v":""},{"$f":"_xlfn.IFNA(VLOOKUP($E$3,Lists!$A:$AA,Z4,FALSE),\"\")","v":""},{"$f":"_xlfn.IFNA(VLOOKUP($E$3,Lists!$A:$AA,AA4,FALSE),\"\")","v":""}]
[{"$f":"IF($C9=\"lochinvar\",\"B-3\",\"\")","v":""},{"$f":"_xlfn.IFNA(VLOOKUP($H$3,Lists!$A:$AA,B4,FALSE),\"\")","v":""},{"$f":"_xlfn.IFNA(VLOOKUP($H$3,Lists!$A:$AA,C4,FALSE),\"\")","v":""},{"$f":"_xlfn.IFNA(VLOOKUP($H$3,Lists!$O29:R52,MATCH(F9,Lists!$O28:R28,0),FALSE),\"\")","v":""},{"$f":"_xlfn.IFNA(VLOOKUP($H$3,Lists!$A:$AA,E4,FALSE),\"\")","v":""},"",{"$f":"_xlfn.IFNA(VLOOKUP($H$3,Lists!$A:$AA,G4,FALSE),\"\")","v":""},{"$f":"_xlfn.IFNA(VLOOKUP($H$3,Lists!$A:$AA,H4,FALSE),\"\")","v":""},{"$f":"_xlfn.IFNA(VLOOKUP($H$3,Lists!$A:$AA,I4,FALSE),\"\")","v":""},{"$f":"_xlfn.IFNA(VLOOKUP($H$3,Lists!$A:$AA,J4,FALSE),\"\")","v":""},{"$f":"_xlfn.IFNA(VLOOKUP($H$3,Lists!$J29:$M52,MATCH(F9,Lists!$J28:$M28,0),FALSE),\"\")","v":""},{"$f":"_xlfn.IFNA(VLOOKUP($H$3,Lists!$A:$AA,L4,FALSE),\"\")","v":""},{"$f":"_xlfn.IFNA(VLOOKUP($H$3,Lists!$A:$AA,M4,FALSE),\"\")","v":""},"",{"$f":"_xlfn.IFNA(VLOOKUP($H$3,Lists!$A:$AA,O4,FALSE),\"\")","v":""},{"$f":"_xlfn.IFNA(VLOOKUP($H$3,Lists!$A:$AA,P4,FALSE),\"\")","v":""},"",{"$f":"IF($Q9=20,VLOOKUP($B$3,Lists!$AF:$AG,2,FALSE),IF($Q9=30,VLOOKUP($B$3,Lists!$AI:$AJ,2,FALSE),IF($Q9=40,VLOOKUP($B$3,Lists!$AL:$AM,2,FALSE),IF($Q9=60,VLOOKUP($B$3,Lists!$AO:$AP,2,FALSE),\"\"))))","v":""},{"$f":"IF($Q9=20,VLOOKUP($B$3,Lists!$AF:$AH,3,FALSE),IF($Q9=30,VLOOKUP($B$3,Lists!$AI:$AK,3,FALSE),IF($Q9=40,VLOOKUP($B$3,Lists!$AL:$AN,3,FALSE),IF($Q9=60,VLOOKUP($B$3,Lists!$AO:$AQ,3,FALSE),\"\"))))","v":""},"","",{"$f":"_xlfn.IFNA(VLOOKUP($H$3,Lists!$A:$AA,V4,FALSE),\"\")","v":""},{"$f":"_xlfn.IFNA(VLOOKUP($H$3,Lists!$A:$AA,W4,FALSE),\"\")","v":""},{"$f":"_xlfn.IFNA(VLOOKUP($H$3,Lists!$A:$AA,X4,FALSE),\"\")","v":""},{"$f":"IF($Z9=\"\",\"\",Y8)","v":""},{"$f":"_xlfn.IFNA(VLOOKUP($H$3,Lists!$A:$AA,Z4,FALSE),\"\")","v":""},{"$f":"_xlfn.IFNA(VLOOKUP($H$3,Lists!$A:$AA,AA4,FALSE),\"\")","v":""}]
[{"$f":"IF($C10=\"lochinvar\",\"B-4\",\"\")","v":""},{"$f":"_xlfn.IFNA(VLOOKUP($K$3,Lists!$A:$AA,B4,FALSE),\"\")","v":""},{"$f":"_xlfn.IFNA(VLOOKUP($K$3,Lists!$A:$AA,C4,FALSE),\"\")","v":""},{"$f":"_xlfn.IFNA(VLOOKUP($K$3,Lists!$O29:R52,MATCH(F10,Lists!$O28:R28,0),FALSE),\"\")","v":""},{"$f":"_xlfn.IFNA(VLOOKUP($K$3,Lists!$A:$AA,E4,FALSE),\"\")","v":""},"",{"$f":"_xlfn.IFNA(VLOOKUP($K$3,Lists!$A:$AA,G4,FALSE),\"\")","v":""},{"$f":"_xlfn.IFNA(VLOOKUP($K$3,Lists!$A:$AA,H4,FALSE),\"\")","v":""},{"$f":"_xlfn.IFNA(VLOOKUP($K$3,Lists!$A:$AA,I4,FALSE),\"\")","v":""},{"$f":"_xlfn.IFNA(VLOOKUP($K$3,Lists!$A:$AA,J4,FALSE),\"\")","v":""},{"$f":"_xlfn.IFNA(VLOOKUP($K$3,Lists!$J29:$M52,MATCH(F10,Lists!$J28:M28,0),FALSE),\"\")","v":""},{"$f":"_xlfn.IFNA(VLOOKUP($K$3,Lists!$A:$AA,L4,FALSE),\"\")","v":""},{"$f":"_xlfn.IFNA(VLOOKUP($K$3,Lists!$A:$AA,M4,FALSE),\"\")","v":""},"",{"$f":"_xlfn.IFNA(VLOOKUP($K$3,Lists!$A:$AA,O4,FALSE),\"\")","v":""},{"$f":"_xlfn.IFNA(VLOOKUP($K$3,Lists!$A:$AA,P4,FALSE),\"\")","v":""},"",{"$f":"IF($Q10=20,VLOOKUP($B$3,Lists!$AF:$AG,2,FALSE),IF($Q10=30,VLOOKUP($B$3,Lists!$AI:$AJ,2,FALSE),IF($Q10=40,VLOOKUP($B$3,Lists!$AL:$AM,2,FALSE),IF($Q10=60,VLOOKUP($B$3,Lists!$AO:$AP,2,FALSE),\"\"))))","v":""},{"$f":"IF($Q10=20,VLOOKUP($B$3,Lists!$AF:$AH,3,FALSE),IF($Q10=30,VLOOKUP($B$3,Lists!$AI:$AK,3,FALSE),IF($Q10=40,VLOOKUP($B$3,Lists!$AL:$AN,3,FALSE),IF($Q10=60,VLOOKUP($B$3,Lists!$AO:$AQ,3,FALSE),\"\"))))","v":""},"","",{"$f":"_xlfn.IFNA(VLOOKUP($K$3,Lists!$A:$AA,V4,FALSE),\"\")","v":""},{"$f":"_xlfn.IFNA(VLOOKUP($K$3,Lists!$A:$AA,W4,FALSE),\"\")","v":""},{"$f":"_xlfn.IFNA(VLOOKUP($K$3,Lists!$A:$AA,X4,FALSE),\"\")","v":""},"",{"$f":"_xlfn.IFNA(VLOOKUP($K$3,Lists!$A:$AA,Z4,FALSE),\"\")","v":""},{"$f":"_xlfn.IFNA(VLOOKUP($K$3,Lists!$A:$AA,AA4,FALSE),\"\")","v":""}]
[{"$f":"IF($C11=\"lochinvar\",\"B-5\",\"\")","v":""},{"$f":"_xlfn.IFNA(VLOOKUP($N$3,Lists!$A:$AA,B4,FALSE),\"\")","v":""},{"$f":"_xlfn.IFNA(VLOOKUP($N$3,Lists!$A:$AA,C4,FALSE),\"\")","v":""},{"$f":"_xlfn.IFNA(VLOOKUP($N$3,Lists!$O29:R52,MATCH(F11,Lists!$O28:R28,0),FALSE),\"\")","v":""},{"$f":"_xlfn.IFNA(VLOOKUP($N$3,Lists!$A:$AA,E4,FALSE),\"\")","v":""},"",{"$f":"_xlfn.IFNA(VLOOKUP($N$3,Lists!$A:$AA,G4,FALSE),\"\")","v":""},{"$f":"_xlfn.IFNA(VLOOKUP($N$3,Lists!$A:$AA,H4,FALSE),\"\")","v":""},{"$f":"_xlfn.IFNA(VLOOKUP($N$3,Lists!$A:$AA,I4,FALSE),\"\")","v":""},{"$f":"_xlfn.IFNA(VLOOKUP($N$3,Lists!$A:$AA,J4,FALSE),\"\")","v":""},{"$f":"_xlfn.IFNA(VLOOKUP($N$3,Lists!$J29:$M52,MATCH(F11,Lists!$J28:M28,0),FALSE),\"\")","v":""},{"$f":"_xlfn.IFNA(VLOOKUP($N$3,Lists!$A:$AA,L4,FALSE),\"\")","v":""},{"$f":"_xlfn.IFNA(VLOOKUP($N$3,Lists!$A:$AA,M4,FALSE),\"\")","v":""},"",{"$f":"_xlfn.IFNA(VLOOKUP($N$3,Lists!$A:$AA,O4,FALSE),\"\")","v":""},{"$f":"_xlfn.IFNA(VLOOKUP($N$3,Lists!$A:$AA,P4,FALSE),\"\")","v":""},"",{"$f":"IF($Q11=20,VLOOKUP($B$3,Lists!$AF:$AG,2,FALSE),IF($Q11=30,VLOOKUP($B$3,Lists!$AI:$AJ,2,FALSE),IF($Q11=40,VLOOKUP($B$3,Lists!$AL:$AM,2,FALSE),IF($Q11=60,VLOOKUP($B$3,Lists!$AO:$AP,2,FALSE),\"\"))))","v":""},{"$f":"IF($Q11=20,VLOOKUP($B$3,Lists!$AF:$AH,3,FALSE),IF($Q11=30,VLOOKUP($B$3,Lists!$AI:$AK,3,FALSE),IF($Q11=40,VLOOKUP($B$3,Lists!$AL:$AN,3,FALSE),IF($Q11=60,VLOOKUP($B$3,Lists!$AO:$AQ,3,FALSE),\"\"))))","v":""},"","",{"$f":"_xlfn.IFNA(VLOOKUP($N$3,Lists!$A:$AA,V4,FALSE),\"\")","v":""},{"$f":"_xlfn.IFNA(VLOOKUP($N$3,Lists!$A:$AA,W4,FALSE),\"\")","v":""},{"$f":"_xlfn.IFNA(VLOOKUP($N$3,Lists!$A:$AA,X4,FALSE),\"\")","v":""},"",{"$f":"_xlfn.IFNA(VLOOKUP($N$3,Lists!$A:$AA,Z4,FALSE),\"\")","v":""},{"$f":"_xlfn.IFNA(VLOOKUP($N$3,Lists!$A:$AA,AA4,FALSE),\"\")","v":""}]
[{"$f":"IF($C12=\"lochinvar\",\"B-6\",\"\")","v":""},{"$f":"_xlfn.IFNA(VLOOKUP($Q$3,Lists!$A:$AA,B4,FALSE),\"\")","v":""},{"$f":"_xlfn.IFNA(VLOOKUP($Q$3,Lists!$A:$AA,C4,FALSE),\"\")","v":""},{"$f":"_xlfn.IFNA(VLOOKUP($Q$3,Lists!$O29:R52,MATCH(F12,Lists!$O28:R28,0),FALSE),\"\")","v":""},{"$f":"_xlfn.IFNA(VLOOKUP($Q$3,Lists!$A:$AA,E4,FALSE),\"\")","v":""},"",{"$f":"_xlfn.IFNA(VLOOKUP($Q$3,Lists!$A:$AA,G4,FALSE),\"\")","v":""},{"$f":"_xlfn.IFNA(VLOOKUP($Q$3,Lists!$A:$AA,H4,FALSE),\"\")","v":""},{"$f":"_xlfn.IFNA(VLOOKUP($Q$3,Lists!$A:$AA,I4,FALSE),\"\")","v":""},{"$f":"_xlfn.IFNA(VLOOKUP($Q$3,Lists!$A:$AA,J4,FALSE),\"\")","v":""},{"$f":"_xlfn.IFNA(VLOOKUP($Q$3,Lists!$J29:$M52,MATCH(F12,Lists!$J28:M28,0),FALSE),\"\")","v":""},{"$f":"_xlfn.IFNA(VLOOKUP($Q$3,Lists!$A:$AA,L4,FALSE),\"\")","v":""},{"$f":"_xlfn.IFNA(VLOOKUP($Q$3,Lists!$A:$AA,M4,FALSE),\"\")","v":""},"",{"$f":"_xlfn.IFNA(VLOOKUP($Q$3,Lists!$A:$AA,O4,FALSE),\"\")","v":""},{"$f":"_xlfn.IFNA(VLOOKUP($Q$3,Lists!$A:$AA,P4,FALSE),\"\")","v":""},"",{"$f":"IF($Q12=20,VLOOKUP($B$3,Lists!$AF:$AG,2,FALSE),IF($Q12=30,VLOOKUP($B$3,Lists!$AI:$AJ,2,FALSE),IF($Q12=40,VLOOKUP($B$3,Lists!$AL:$AM,2,FALSE),IF($Q12=60,VLOOKUP($B$3,Lists!$AO:$AP,2,FALSE),\"\"))))","v":""},{"$f":"IF($Q12=20,VLOOKUP($B$3,Lists!$AF:$AH,3,FALSE),IF($Q12=30,VLOOKUP($B$3,Lists!$AI:$AK,3,FALSE),IF($Q12=40,VLOOKUP($B$3,Lists!$AL:$AN,3,FALSE),IF($Q12=60,VLOOKUP($B$3,Lists!$AO:$AQ,3,FALSE),\"\"))))","v":""},"","",{"$f":"_xlfn.IFNA(VLOOKUP($Q$3,Lists!$A:$AA,V4,FALSE),\"\")","v":""},{"$f":"_xlfn.IFNA(VLOOKUP($Q$3,Lists!$A:$AA,W4,FALSE),\"\")","v":""},{"$f":"_xlfn.IFNA(VLOOKUP($Q$3,Lists!$A:$AA,X4,FALSE),\"\")","v":""},"",{"$f":"_xlfn.IFNA(VLOOKUP($Q$3,Lists!$A:$AA,Z4,FALSE),\"\")","v":""},{"$f":"_xlfn.IFNA(VLOOKUP($Q$3,Lists!$A:$AA,AA4,FALSE),\"\")","v":""}]
[{"$f":"IF($C13=\"lochinvar\",\"B-7\",\"\")","v":""},{"$f":"_xlfn.IFNA(VLOOKUP($T$3,Lists!$A:$AA,B4,FALSE),\"\")","v":""},{"$f":"_xlfn.IFNA(VLOOKUP($T$3,Lists!$A:$AA,C4,FALSE),\"\")","v":""},{"$f":"_xlfn.IFNA(VLOOKUP($T$3,Lists!$O29:R52,MATCH(F13,Lists!$O28:R28,0),FALSE),\"\")","v":""},{"$f":"_xlfn.IFNA(VLOOKUP($T$3,Lists!$A:$AA,E4,FALSE),\"\")","v":""},"",{"$f":"_xlfn.IFNA(VLOOKUP($T$3,Lists!$A:$AA,G4,FALSE),\"\")","v":""},{"$f":"_xlfn.IFNA(VLOOKUP($T$3,Lists!$A:$AA,H4,FALSE),\"\")","v":""},{"$f":"_xlfn.IFNA(VLOOKUP($T$3,Lists!$A:$AA,I4,FALSE),\"\")","v":""},{"$f":"_xlfn.IFNA(VLOOKUP($T$3,Lists!$A:$AA,J4,FALSE),\"\")","v":""},{"$f":"_xlfn.IFNA(VLOOKUP($T$3,Lists!$J29:$M52,MATCH(F13,Lists!$J28:M28,0),FALSE),\"\")","v":""},{"$f":"_xlfn.IFNA(VLOOKUP($T$3,Lists!$A:$AA,L4,FALSE),\"\")","v":""},{"$f":"_xlfn.IFNA(VLOOKUP($T$3,Lists!$A:$AA,M4,FALSE),\"\")","v":""},"",{"$f":"_xlfn.IFNA(VLOOKUP($T$3,Lists!$A:$AA,O4,FALSE),\"\")","v":""},{"$f":"_xlfn.IFNA(VLOOKUP($T$3,Lists!$A:$AA,P4,FALSE),\"\")","v":""},"",{"$f":"IF($Q13=20,VLOOKUP($B$3,Lists!$AF:$AG,2,FALSE),IF($Q13=30,VLOOKUP($B$3,Lists!$AI:$AJ,2,FALSE),IF($Q13=40,VLOOKUP($B$3,Lists!$AL:$AM,2,FALSE),IF($Q13=60,VLOOKUP($B$3,Lists!$AO:$AP,2,FALSE),\"\"))))","v":""},{"$f":"IF($Q13=20,VLOOKUP($B$3,Lists!$AF:$AH,3,FALSE),IF($Q13=30,VLOOKUP($B$3,Lists!$AI:$AK,3,FALSE),IF($Q13=40,VLOOKUP($B$3,Lists!$AL:$AN,3,FALSE),IF($Q13=60,VLOOKUP($B$3,Lists!$AO:$AQ,3,FALSE),\"\"))))","v":""},"","",{"$f":"_xlfn.IFNA(VLOOKUP($T$3,Lists!$A:$AA,V4,FALSE),\"\")","v":""},{"$f":"_xlfn.IFNA(VLOOKUP($T$3,Lists!$A:$AA,W4,FALSE),\"\")","v":""},{"$f":"_xlfn.IFNA(VLOOKUP($T$3,Lists!$A:$AA,X4,FALSE),\"\")","v":""},"",{"$f":"_xlfn.IFNA(VLOOKUP($T$3,Lists!$A:$AA,Z4,FALSE),\"\")","v":""},{"$f":"_xlfn.IFNA(VLOOKUP($T$3,Lists!$A:$AA,AA4,FALSE),\"\")","v":""}]
[{"$f":"IF($C14=\"lochinvar\",\"B-8\",\"\")","v":""},{"$f":"_xlfn.IFNA(VLOOKUP($W$3,Lists!$A:$AA,B4,FALSE),\"\")","v":""},{"$f":"_xlfn.IFNA(VLOOKUP($W$3,Lists!$A:$AA,C4,FALSE),\"\")","v":""},{"$f":"_xlfn.IFNA(VLOOKUP($W$3,Lists!$O29:R52,MATCH(F14,Lists!$O28:R28,0),FALSE),\"\")","v":""},{"$f":"_xlfn.IFNA(VLOOKUP($W$3,Lists!$A:$AA,E4,FALSE),\"\")","v":""},"",{"$f":"_xlfn.IFNA(VLOOKUP($W$3,Lists!$A:$AA,G4,FALSE),\"\")","v":""},{"$f":"_xlfn.IFNA(VLOOKUP($W$3,Lists!$A:$AA,H4,FALSE),\"\")","v":""},{"$f":"_xlfn.IFNA(VLOOKUP($W$3,Lists!$A:$AA,I4,FALSE),\"\")","v":""},{"$f":"_xlfn.IFNA(VLOOKUP($W$3,Lists!$A:$AA,J4,FALSE),\"\")","v":""},{"$f":"_xlfn.IFNA(VLOOKUP($W$3,Lists!$J29:$M52,MATCH(F14,Lists!$J28:M28,0),FALSE),\"\")","v":""},{"$f":"_xlfn.IFNA(VLOOKUP($W$3,Lists!$A:$AA,L4,FALSE),\"\")","v":""},{"$f":"_xlfn.IFNA(VLOOKUP($W$3,Lists!$A:$AA,M4,FALSE),\"\")","v":""},"",{"$f":"_xlfn.IFNA(VLOOKUP($W$3,Lists!$A:$AA,O4,FALSE),\"\")","v":""},{"$f":"_xlfn.IFNA(VLOOKUP($W$3,Lists!$A:$AA,P4,FALSE),\"\")","v":""},"",{"$f":"IF($Q14=20,VLOOKUP($B$3,Lists!$AF:$AG,2,FALSE),IF($Q14=30,VLOOKUP($B$3,Lists!$AI:$AJ,2,FALSE),IF($Q14=40,VLOOKUP($B$3,Lists!$AL:$AM,2,FALSE),IF($Q14=60,VLOOKUP($B$3,Lists!$AO:$AP,2,FALSE),\"\"))))","v":""},{"$f":"IF($Q14=20,VLOOKUP($B$3,Lists!$AF:$AH,3,FALSE),IF($Q14=30,VLOOKUP($B$3,Lists!$AI:$AK,3,FALSE),IF($Q14=40,VLOOKUP($B$3,Lists!$AL:$AN,3,FALSE),IF($Q14=60,VLOOKUP($B$3,Lists!$AO:$AQ,3,FALSE),\"\"))))","v":""},"","",{"$f":"_xlfn.IFNA(VLOOKUP($W$3,Lists!$A:$AA,V4,FALSE),\"\")","v":""},{"$f":"_xlfn.IFNA(VLOOKUP($W$3,Lists!$A:$AA,W4,FALSE),\"\")","v":""},{"$f":"_xlfn.IFNA(VLOOKUP($W$3,Lists!$A:$AA,X4,FALSE),\"\")","v":""},"",{"$f":"_xlfn.IFNA(VLOOKUP($W$3,Lists!$A:$AA,Z4,FALSE),\"\")","v":""},{"$f":"_xlfn.IFNA(VLOOKUP($W$3,Lists!$A:$AA,AA4,FALSE),\"\")","v":""}]
[]
["Schedule Notes:"]
["1.   Boiler shall meet ANSI Standard Z21.13 and thermal and combustion efficiencies and shall be AHRI certified.    "]
["2.   Boiler to be CSD-1 / Factory Mutual / GAPS, and California Code Compliant. "]
["3.   Boilers must be low NOX approved for South Coast Air Quality Management District Rule 1146.2 (for boilers up to 2000 MBH) and Bay Area Air Quality Management District. "]
["4.   Boiler heat exchanger shall be condensing, stainless steel, fire tube design.  No exceptions.  "]
{"$rows_left_out":18}